{"text_format":"1","workbook":"xlsx","n_sheets":5,"sheets":["Introduction","Assumptions","Rent Roll","Monthly Cash Flow","Annual Cash Flow"],"not_rendered":{"charts":0,"images":1,"macros":1,"external_links":0,"defined_names":0,"comments":0,"pivot_tables":0},"unopened":[],"bounds":{"document_bytes":16777216,"sheet_cells":100000,"rows_first":2000,"rows_last":500,"rows_between":2000,"halvings":0,"cell_chars":16384,"cell_head_chars":4096},"cells_cut":0,"cells_raw":0,"read":"whole","date_system":"1900"}

{"sheet":"Introduction","index":0,"n_rows":0,"n_cols":0,"rows_kept":0,"cut":false,"hidden":false,"merged":[]}

{"sheet":"Assumptions","index":1,"n_rows":22,"n_cols":10,"rows_kept":22,"cut":false,"hidden":false,"merged":[]}
["Assumptions"]
[]
[null,"Assumptions",null,null,"Expense Name","Annual $/SF",null,"Uses and Sources","$","$/SF"]
[null,"Acquisition Date","2020-06-01",null,"Insurance",0.5,null,"Sources:"]
[null,"Expense Growth",0.02,null,"Snow Removal",1.5,null,"Loan",{"$f":"+I10*0.75","v":1875000},{"$f":"I5/'Rent Roll'!$D$9","v":1.2234910277324633}]
[null,"General Vacancy",0.05,null,"Summer Maintenance",0.25,null,"Equity",{"$f":"I7-I5","v":645000},{"$f":"I6/'Rent Roll'!$D$9","v":0.42088091353996737}]
{"$rows_left_out":17}
{"sheet":"Rent Roll","index":2,"n_rows":9,"n_cols":36,"rows_kept":9,"cut":false,"hidden":false,"merged":[]}
["Rent Roll"]
[]
[null,"#","Suite","Leased / Spec","Tenant","SF","% of Total","Annual $/SF","Annual Increase %","Lease Start Date","Lease End Date","Remaining Term","Reimbursement Annual $/SF",null,"Rollover Annual $/SF","Annual Rent Increase %","Downtime ","Renewal Probability","Lease Length (Mo.)","Reimbursement Annual $/SF","New TI","Renew TI","New LC","Renew LC","Free Rent New (Mo.)","Free Rent Renew (Mo.)",null,null,"Underewritten Downtime","Downtime Start Date","Downtime End Date","Underewritten Free Time","Free Rent Start Date","Free Rent End Date","Underwritten TI","Underwritten Leasing Commissions"]
[null,1,100,500,"ABC",6554,{"$f":"+F4/$F$9","v":0.35270692067592296},12.5,0.02,"2019-06-01","2024-08-01",{"$f":"ROUND((K4-J4)/365.25,1)","v":5.2},8.4540000000000006,null,13.5,0.02,12,0.5,{"$f":"5*12","v":60},9,25,10,0.03,1.4999999999999999E-2,1,1,null,null,{"$f":"ROUND((1-R4)*Q4,0)","v":6},{"$f":"MAX(K4,Assumptions!$C$4)","v":"2024-08-01"},{"$f":"IF(AD4=Assumptions!$C$4,EOMONTH(AD4,AC4-1),EOMONTH(AD4,AC4))","v":"2025-02-28"},{"$f":"ROUND(R4*Z4+(1-R4)*Y4,0)","v":1},{"$f":"+AE4","v":"2025-02-28"},{"$f":"EOMONTH(AG4,AF4)","v":"2025-03-31"},{"$f":"(R4*V4+(1-R4)*U4)*F4","v":114695},{"$f":"(R4*X4+(1-R4)*W4)*(O4*F4*S4/12)","v":9953.8874999999989}]
[null,{"$f":"+B4+1","v":2},200,750,"EFG",4337,{"$f":"+F5/$F$9","v":0.23339791195780862},10.199999999999999,0.02,"2017-07-01","2024-08-01",{"$f":"ROUND((K5-J5)/365.25,1)","v":7.1},8.4540000000000006,null,11.12,0.02,12,0.5,{"$f":"5*12","v":60},9,25,10,0.03,1.4999999999999999E-2,1,1,null,null,{"$f":"ROUND((1-R5)*Q5,0)","v":6},{"$f":"MAX(K5,Assumptions!$C$4)","v":"2024-08-01"},{"$f":"IF(AD5=Assumptions!$C$4,EOMONTH(AD5,AC5-1),EOMONTH(AD5,AC5))","v":"2025-02-28"},{"$f":"ROUND(R5*Z5+(1-R5)*Y5,0)","v":1},{"$f":"+AE5","v":"2025-02-28"},{"$f":"EOMONTH(AG5,AF5)","v":"2025-03-31"},{"$f":"(R5*V5+(1-R5)*U5)*F5","v":75897.5},{"$f":"(R5*X5+(1-R5)*W5)*(O5*F5*S5/12)","v":5425.5869999999995}]
[null,{"$f":"+B5+1","v":3},300,875,"ASD",4626,0.2489505973522764,6.12,0.02,"2020-03-01","2024-08-01",4.4000000000000004,8.4540000000000006,null,6.63,0.02,12,0.5,60,9,25,10,0.03,1.4999999999999999E-2,1,1,null,null,6,{"$f":"MAX(K6,Assumptions!$C$4)","v":"2024-08-01"},{"$f":"IF(AD6=Assumptions!$C$4,EOMONTH(AD6,AC6-1),EOMONTH(AD6,AC6))","v":"2025-02-28"},1,"2025-02-28","2025-03-31",80955,3450.4177499999996]
{"$rows_left_out":4}
{"sheet":"Monthly Cash Flow","index":3,"n_rows":99,"n_cols":65,"rows_kept":99,"cut":false,"hidden":false,"merged":[]}
["Monthly Cash Flow",null,null,null,null,null,null,null,null,null,null,null,null,null,null,null,null,null,null,null,null,null,null,null,null,null,null,null,null,null,null,null,null,null,null,null,null,null,null,null,null,null,null,null,null,null,null,null,null,null,null,null,null,null,null,null,null,null,null,null,null,null,null,null,"STOP"]
[null,null,null,null,null,null,null,null,null,null,null,null,null,null,null,null,null,null,null,null,null,null,null,null,null,null,null,null,null,null,null,null,null,null,null,null,null,null,null,null,null,null,null,null,null,null,null,null,null,null,null,null,null,null,null,null,null,null,null,null,null,null,null,null,"STOP"]
[null,"Year",0,{"$f":"ROUNDUP(D4/12,0)","v":1},{"$f":"ROUNDUP(E4/12,0)","v":1},1,1,1,1,1,1,1,1,1,1,2,2,2,2,2,2,2,2,2,2,2,2,3,3,3,3,3,3,3,3,3,3,3,3,4,4,4,4,4,4,4,4,4,4,4,4,5,5,5,5,5,5,5,5,5,5,5,5,null,"STOP"]
[null,"Month",0,{"$f":"+C4+1","v":1},{"$f":"+D4+1","v":2},3,4,5,6,7,8,9,10,11,12,13,14,15,16,17,18,19,20,21,22,23,24,25,26,27,28,29,30,31,32,33,34,35,36,37,38,39,40,41,42,43,44,45,46,47,48,49,50,51,52,53,54,55,56,57,58,59,60,null,"STOP"]
[null,"Date",{"$f":"+Assumptions!C4","v":"2020-06-01"},{"$f":"EOMONTH(C5,0)","v":"2020-06-30"},{"$f":"EOMONTH(D5,1)","v":"2020-07-31"},{"$f":"EOMONTH(E5,1)","v":"2020-08-31"},"2020-09-30","2020-10-31","2020-11-30","2020-12-31","2021-01-31","2021-02-28","2021-03-31","2021-04-30","2021-05-31","2021-06-30","2021-07-31","2021-08-31","2021-09-30","2021-10-31","2021-11-30","2021-12-31","2022-01-31","2022-02-28","2022-03-31","2022-04-30","2022-05-31","2022-06-30","2022-07-31","2022-08-31","2022-09-30","2022-10-31","2022-11-30","2022-12-31","2023-01-31","2023-02-28","2023-03-31","2023-04-30","2023-05-31","2023-06-30","2023-07-31","2023-08-31","2023-09-30","2023-10-31","2023-11-30","2023-12-31","2024-01-31","2024-02-29","2024-03-31","2024-04-30","2024-05-31","2024-06-30","2024-07-31","2024-08-31","2024-09-30","2024-10-31","2024-11-30","2024-12-31","2025-01-31","2025-02-28","2025-03-31","2025-04-30","2025-05-31",null,"STOP"]
[null,"GROSS POTENTIAL REVENUE:",null,null,null,null,null,null,null,null,null,null,null,null,null,null,null,null,null,null,null,null,null,null,null,null,null,null,null,null,null,null,null,null,null,null,null,null,null,null,null,null,null,null,null,null,null,null,null,null,null,null,null,null,null,null,null,null,null,null,null,null,null,null,"STOP"]
{"$rows_left_out":94}
{"sheet":"Annual Cash Flow","index":4,"n_rows":100,"n_cols":10,"rows_kept":100,"cut":false,"hidden":false,"merged":[]}
["Annual Cash Flow",null,null,null,null,null,null,null,null,"STOP"]
[null,null,null,null,null,null,null,null,null,"STOP"]
[null,"Year",0,{"$f":"+C3+1","v":1},{"$f":"+D3+1","v":2},3,4,5,null,"STOP"]
[null,null,null,null,null,null,null,null,null,"STOP"]
[null,null,null,null,null,null,null,null,null,"STOP"]
[null,"GROSS POTENTIAL REVENUE:",null,null,null,null,null,null,null,"STOP"]
{"$rows_left_out":94}